{"text_format":"1","workbook":"xlsx","n_sheets":12,"sheets":["Known_Issues","Help_Guide","General_Information","Glazing_Systems","Wall_Systems","Shading_Systems","Wall_Glazing_Areas","User_Library","Report","J1.5A_Calcs","J1.5B_Calcs","NCC_Support_Text"],"not_rendered":{"charts":17,"images":31,"macros":1,"external_links":1,"defined_names":49,"comments":0,"pivot_tables":0},"unopened":[],"bounds":{"document_bytes":16777216,"sheet_cells":100000,"rows_first":2000,"rows_last":500,"rows_between":2000,"halvings":0,"cell_chars":16384,"cell_head_chars":4096},"cells_cut":0,"cells_raw":0,"read":"whole","date_system":"1900"}

{"sheet":"Known_Issues","index":0,"n_rows":60,"n_cols":9,"rows_kept":60,"cut":false,"hidden":false,"merged":[[0,1,3,9],[4,8,5,9],[6,1,6,2],[59,1,59,6]]}
[]
[]
[]
[]
[null,null,null,null,null,null,null,null,"Calculator"]
[]
[null,"Known Issues"]
[]
[null,"In testing the current version of this calculator (v1.1), some functionality issues have been identified. These functionality issues do not affect calculations in the tool."]
[]
[null,"General"]
[null,"Issue:","Saving as an Excel file"]
[null,"Fix:","Use the Export function and Change the File Type to a Macro-enabled Workbook. "]
[null,"Applicable Excel version:","MS Office 365 ProPlus Excel"]
[]
{"$rows_left_out":46}
{"sheet":"Help_Guide","index":1,"n_rows":593,"n_cols":9,"rows_kept":593,"cut":false,"hidden":false,"merged":[[509,1,509,6],[0,1,3,9],[4,8,5,9],[6,1,6,2],[48,1,48,2],[143,1,144,9]]}
[]
[]
[]
[]
[null,null,null,null,null,null,null,null,"Calculator"]
[]
[null,"Technical Information "]
[]
[null,"Users of this tool are reminded that they must ensure any products, elements and designs entered into this tool are appropriate for the building they are to be installed in. "]
[null,"This includes ensuring that these products, elements and designs meet all other applicable requirements of the National Construction Code, such as for fire safety, amenity, condensation and structural reliability."]
[null," "]
[]
[null,"1. Version"]
[]
[null,"•\t  This version of the Façade Calculator was first issued for use with Part J1.5 Walls and glazing (specifically 1.5a and 1.5b) in Volume One of NCC 2019"]
{"$rows_left_out":579}
{"sheet":"General_Information","index":2,"n_rows":33,"n_cols":8,"rows_kept":33,"cut":false,"hidden":false,"merged":[[39,1,40,7],[0,1,3,10],[4,7,5,10],[4,1,5,2],[32,1,32,2],[9,4,9,9]]}
[]
[]
[]
[]
[null,null,null,null,null,null,null,"Calculator"]
[]
[null,"General Information"]
[]
[]
[null,"Name"]
[]
[null,"Position"]
[]
[null,"Company"]
[]
{"$rows_left_out":19}
{"sheet":"Glazing_Systems","index":3,"n_rows":47,"n_cols":11,"rows_kept":47,"cut":false,"hidden":false,"merged":[[6,1,6,2],[0,1,3,11],[51,1,52,7],[4,10,5,11],[46,1,46,6]]}
[]
[]
[]
[]
[null,null,null,null,null,null,null,null,null,null,"Calculator"]
[]
[null,"Glazing Systems"]
[]
[]
[null,null,"Glazing Reference","System Type","Glass Type","Frame Type","Glass U-Value ","Glass SHGC",null,"Total System U-Value ","Total System SHGC"]
[null,null,null,null,null,null,"(W/m².K)",null,null,"(W/m².K)"]
[null,1,null,null,null,null,{"$f":"IFERROR(INDEX(User_Library!$C$10:$C$66,MATCH(Glazing_Systems!E12,User_Library!$B$10:$B$66,0)),\"\")","v":""},{"$f":"IFERROR(INDEX(User_Library!$D$10:$D$66,MATCH(Glazing_Systems!E12,User_Library!$B$10:$B$66,0)),\"\")","v":""}]
[]
[null,2,null,null,null,null,{"$f":"IFERROR(INDEX(User_Library!$C$10:$C$66,MATCH(Glazing_Systems!E14,User_Library!$B$10:$B$66,0)),\"\")","v":""},{"$f":"IFERROR(INDEX(User_Library!$D$10:$D$66,MATCH(Glazing_Systems!E14,User_Library!$B$10:$B$66,0)),\"\")","v":""}]
[]
{"$rows_left_out":33}
{"sheet":"Wall_Systems","index":4,"n_rows":88,"n_cols":322,"rows_kept":88,"cut":false,"hidden":false,"merged":[[92,1,93,5],[43,1,43,9],[77,6,77,7],[0,1,3,9],[6,1,6,2],[79,6,79,7],[75,5,75,7],[73,4,73,7],[4,1,5,9]]}
[]
[]
[]
[]
[null,"Calculator"]
[]
[null,"Wall Systems"]
[]
[]
[null,null,"Wall Reference","Wall Type","Spandrel Methodology","Wall Construction","Wall Thickness","Total System R-Value","Solar Absorptance"]
[null,null,null,null,null,null,"(mm)","(m².K/W)"]
[null,1,null,null,null,null,null,{"$f":"IFERROR(IF(D12=\"Wall\",VLOOKUP(F12,User_Library!$J$7:$K$100,2,FALSE),VLOOKUP(F12,User_Library!$L$7:$M$100,2,FALSE)),\"\")","v":""}]
[]
[null,2,null,null,null,null,null,{"$f":"IFERROR(IF(D14=\"Wall\",VLOOKUP(F14,User_Library!$J$7:$K$100,2,FALSE),VLOOKUP(F14,User_Library!$L$7:$M$100,2,FALSE)),\"\")","v":""},null,false]
[]
{"$rows_left_out":74}
{"sheet":"Shading_Systems","index":5,"n_rows":47,"n_cols":7,"rows_kept":47,"cut":false,"hidden":false,"merged":[[0,1,3,9],[6,1,6,2],[52,1,53,7],[4,1,5,9]]}
[]
[]
[]
[]
[null,"Calculator"]
[]
[null,"Shading Systems"]
[]
[]
[null,null,"Shading Reference","Shading Type","P","G","H"]
[null,null,null,null,"(m)","(m)","(m)"]
[null,1]
[]
[null,2]
[]
{"$rows_left_out":33}
{"sheet":"Wall_Glazing_Areas","index":6,"n_rows":205,"n_cols":13,"rows_kept":205,"cut":false,"hidden":false,"merged":[[209,1,210,5],[9,2,9,3],[9,4,9,5],[5,2,5,5],[190,2,190,6],[186,3,186,4],[7,2,7,5],[20,1,20,2],[190,8,190,11],[5,6,5,8],[191,10,191,11],[193,10,193,11],[2,11,3,11],[0,1,3,6],[9,6,9,8],[9,9,9,11],[4,11,4,13]]}
[]
[]
[]
[]
[null,null,null,null,null,null,null,null,null,null,null,"Calculator"]
[null,"Results",null,null,null,null,{"$f":"General_Information!C21","v":0},null,null,{"$f":"General_Information!C23","v":0}]
[]
[null,null,"Method 1",null,null,null,null,null,null,"Method 2"]
[]
[]
[]
[null,null,null,null,null,null,null,null,{"$f":"IFERROR('J1.5A_Calcs'!B11,\"\")","v":""},null,null,false]
[]
[]
[]
{"$rows_left_out":191}
{"sheet":"User_Library","index":7,"n_rows":40,"n_cols":15,"rows_kept":40,"cut":false,"hidden":false,"merged":[[4,12,4,14],[13,6,98,6],[0,1,3,6],[4,1,4,3],[4,4,4,6],[4,9,4,10]]}
[]
[]
[]
[]
[null,null,null,null,null,null,null,null,null,null,null,null,"Calculator"]
[null,"Glass Types","U-value (W/m2.K)","SHGC","Materials","Thermal Conductivity (W/m.K)","R-Value (m2.K/W) ","Frame Types","System Types","Wall Types","R-Value (m2.K/W)","NCC Spec J1.5B, Spandrels","R-Value (m2.K/W) ","Thermal Bridges","Thermal Conductivity (W/m.K)"]
[]
[null,"DEFAULTS (GENERIC)","-","-","DEFAULTS (GENERIC)","-","-","DEFAULTS (GENERIC)","DEFAULTS (GENERIC)","DEFAULTS (GENERIC)","-","DEFAULTS (GENERIC)",null,"DEFAULTS (GENERIC)","-"]
[]
[null,"Double Glazed Unit - single low-E coating",1.8,0.4,"Airspace - non-reflective","n/a",0.17,"Aluminium","Awning","Masonry (90mm glass wool + timber studs)",2.39,"Spandrel Config 1 - no ",0.3,"None",0]
[null,"Double Glazed Unit  - double low-E coating",1.6,0.35,"Airspace - 20mm, inner surface 0.05 emittance","n/a",0.48,"Steel","Casement","Cavity masonry  (90mm glass wool + timber studs)",2.65,"Spandrel Config 1 - R0.5 ",0.39,"Timber",0.1]
[null,"Double Glazed Unit - triple low-E coating",1.3,0.25,"Airspace - 70mm, inner surface 0.05 emittance","n/a",0.43,"Timber","Fixed","Timber wall (uninsulated + timber studs)",0.25,"Spandrel Config  1 - R1.0 ",0.42,"Steel",47.5]
[null,"Double Glazed Unit - no low-E coating",2.8,0.65,"Airspace - 35mm, outer surface 0.20 emittance","n/a",0.5,"uPVC","Sliding Door","Timber wall (90mm glass wool + timber studs)",2.3199999999999998,"Spandrel Config 1 - R1.5 ",0.44,"EPS",0.04]
[null,"Single glazing",5.6,0.56000000000000005,"Aluminium - sheeting",210,null,"Aluminium thermally broken","Punch Window",null,null,"Spandrel Config 1 - R2.0 ",0.45]
[null,"Single Glazing - low-E coating",3.6,0.53,"Cement render (1 cement: 4 sand)",0.53,null,null,null,"USER (DEFINED)","-","Spandrel Config 2 - no ",0.35,"USER (DEFINED)","-"]
{"$rows_left_out":26}
{"sheet":"Report","index":8,"n_rows":106,"n_cols":10,"rows_kept":106,"cut":false,"hidden":false,"merged":[[4,9,5,10],[55,6,58,6],[55,7,58,7],[55,8,58,8],[78,5,79,5],[68,5,70,5],[78,6,79,6],[68,6,70,6],[60,5,62,5],[29,2,30,2],[6,1,6,2],[12,5,12,8],[33,2,34,2],[8,4,10,7],[83,5,85,5],[83,6,85,6],[68,8,70,8],[78,7,79,7],[78,8,79,8],[0,1,3,10],[97,5,97,8],[93,4,94,4],[87,5,87,8],[89,4,91,4],[55,4,58,4],[78,4,79,4],[93,5,94,5],[93,6,94,6],[93,7,94,7],[93,8,94,8],[89,5,91,5],[89,6,91,6],[89,7,91,7],[83,7,85,7],[83,8,85,8],[111,1,112,5],[45,1,45,10],[64,5,66,5],[64,6,66,6],[64,7,66,7],[64,8,66,8],[60,6,62,6],[60,7,62,7],[60,8,62,8],[55,5,58,5],[83,4,85,4],[64,4,66,4],[60,4,62,4],[68,4,70,4],[68,7,70,7],[89,8,91,8]]}
[]
[]
[]
[]
[null,null,null,null,null,null,null,null,null,"Calculator"]
[]
[null,"Project Summary"]
[]
[null,null,null,null,"The summary below provides an overview of where compliance has been achieved for Specification J1.5a - Calculation of U-Value and solar admittance - Method 1 (Single Aspect) and Method 2 (Multiple Apects).",null,null,null,"Compliant Solution = "]
[null,null,"Date",null,null,null,null,null,"Non-Compliant Solution = "]
[null,null,{"$f":"TODAY()","v":"2020-11-26"}]
[]
[null,null,"Name",null,null,"Method 1",null,null,null,"Method 2"]
[null,null,{"$f":"General_Information!C10","v":0},null,null,"North","East","South","West","All"]
[]
{"$rows_left_out":92}
{"sheet":"J1.5A_Calcs","index":9,"n_rows":250,"n_cols":76,"rows_kept":250,"cut":false,"hidden":true,"merged":[[116,2,116,17],[154,2,154,17],[0,0,2,16383],[40,2,40,17],[78,2,78,17],[8,6,8,9],[8,10,8,13],[40,18,40,33],[78,18,78,33],[116,18,116,33],[154,18,154,33],[65,22,65,23],[66,22,66,23],[67,22,67,23],[68,22,68,23],[69,22,69,23],[70,22,70,23],[71,22,71,23],[72,22,72,23],[64,24,64,26],[109,22,109,23],[110,22,110,23],[103,22,103,23],[102,24,102,26],[104,22,104,23],[105,22,105,23],[106,22,106,23],[107,22,107,23],[108,22,108,23],[146,22,146,23],[147,22,147,23],[148,22,148,23],[140,24,140,26],[141,22,141,23],[142,22,142,23],[143,22,143,23],[144,22,144,23],[145,22,145,23]]}
["All information held within this worksheet is for the reference and calculations of J1.5A only. This sheet is subject to auditing and maintainence and therefore must be clear and organsied."]
[]
[]
["Climate Zone",{"$f":"VLOOKUP(General_Information!C23,NCC_Support_Text!A88:B95,2,FALSE)","v":{"$error":"#N/A"}}]
["Building Class",{"$f":"VLOOKUP(General_Information!C21,NCC_Support_Text!A8:B27,2,FALSE)","v":{"$error":"#N/A"}}]
["Is class 3/9a ward/9c?",{"$f":"IF(OR(B5=\"9a ward\",B5=3,B5=\"9c\"),TRUE,FALSE)","v":{"$error":"#N/A"}}]
["Is display glazing",{"$f":"IF(B5=\"6 display\",TRUE,FALSE)","v":{"$error":"#N/A"}}]
[]
["Targets",null,null,null,null,null,"Solar admittance",null,null,null,"Weighting coefficient"]
[null,"U-value","R-value < 80%","U-value < 80%","R-value >= 80%","U-value >= 80%","North","East","South","West","North","East","South","West"]
[null,{"$f":"IF($B$6=TRUE,HLOOKUP($B$4,NCC_Support_Text!B38:I40,3,FALSE),HLOOKUP($B$4,NCC_Support_Text!B38:I40,2,FALSE))","v":{"$error":"#N/A"}},{"$f":"IF($B$6=TRUE,HLOOKUP($B$4,NCC_Support_Text!B32:I34,3,FALSE),HLOOKUP($B$4,NCC_Support_Text!B32:I34,2,FALSE))","v":{"$error":"#N/A"}},{"$f":"1/C11","v":{"$error":"#N/A"}},{"$f":"IF($B$6=TRUE,HLOOKUP($B$4,NCC_Support_Text!J32:Q34,3,FALSE),HLOOKUP($B$4,NCC_Support_Text!J32:Q34,2,FALSE))","v":{"$error":"#N/A"}},{"$f":"1/E11","v":{"$error":"#N/A"}},{"$f":"IF($B$6=TRUE,HLOOKUP($B$4,NCC_Support_Text!$B52:$I56,2,FALSE),HLOOKUP($B$4,NCC_Support_Text!$B45:$I49,2,FALSE))","v":{"$error":"#N/A"}},{"$f":"IF($B$6=TRUE,HLOOKUP($B$4,NCC_Support_Text!$B52:$I56,3,FALSE),HLOOKUP($B$4,NCC_Support_Text!$B45:$I49,3,FALSE))","v":{"$error":"#N/A"}},{"$f":"IF($B$6=TRUE,HLOOKUP($B$4,NCC_Support_Text!$B52:$I56,4,FALSE),HLOOKUP($B$4,NCC_Support_Text!$B45:$I49,4,FALSE))","v":{"$error":"#N/A"}},{"$f":"IF($B$6=TRUE,HLOOKUP($B$4,NCC_Support_Text!$B52:$I56,5,FALSE),HLOOKUP($B$4,NCC_Support_Text!$B45:$I49,5,FALSE))","v":{"$error":"#N/A"}},{"$f":"IF($B$6=TRUE,HLOOKUP($B$4,NCC_Support_Text!$B68:$I72,2,FALSE),HLOOKUP($B$4,NCC_Support_Text!$B61:$I65,2,FALSE))","v":{"$error":"#N/A"}},{"$f":"IF($B$6=TRUE,HLOOKUP($B$4,NCC_Support_Text!$B68:$I72,3,FALSE),HLOOKUP($B$4,NCC_Support_Text!$B61:$I65,3,FALSE))","v":{"$error":"#N/A"}},{"$f":"IF($B$6=TRUE,HLOOKUP($B$4,NCC_Support_Text!$B68:$I72,4,FALSE),HLOOKUP($B$4,NCC_Support_Text!$B61:$I65,4,FALSE))","v":{"$error":"#N/A"}},{"$f":"IF($B$6=TRUE,HLOOKUP($B$4,NCC_Support_Text!$B68:$I72,5,FALSE),HLOOKUP($B$4,NCC_Support_Text!$B61:$I65,5,FALSE))","v":{"$error":"#N/A"}}]
[]
[]
[]
["Summary of Systems"]
{"$rows_left_out":236}
{"sheet":"J1.5B_Calcs","index":10,"n_rows":98,"n_cols":8,"rows_kept":98,"cut":false,"hidden":true,"merged":[[0,0,2,16383]]}
["All information held within this worksheet is for the reference and calculations of J1.5B only. This sheet is subject to auditing and maintainence and therefore must be clear and organsied."]
[]
[]
[]
["J1.5B Calcs",true]
[null,null,null,"Bridged Layer"]
["Wall System 01","Ext - Layer 1","Layer 2","Layer 3","Layer 4","Layer 5","Layer 6","Layer 7"]
["Material ",{"$f":"Wall_Systems!C51","v":0},{"$f":"Wall_Systems!D51","v":0},{"$f":"Wall_Systems!E51","v":0},{"$f":"Wall_Systems!F51","v":0},{"$f":"Wall_Systems!G51","v":0},{"$f":"Wall_Systems!H51","v":0},{"$f":"Wall_Systems!I51","v":0}]
["Is material?",{"$f":"IF(OR(B8=\"\",B8=0),FALSE,TRUE)","v":false},{"$f":"IF(OR(C8=\"\",C8=0),FALSE,TRUE)","v":false},false,false,false,false,false]
["Is air space?",{"$f":"IF(B9=TRUE,ISNUMBER(SEARCH(\"Airspace\",B8)),\"\")","v":""},{"$f":"IF(C9=TRUE,ISNUMBER(SEARCH(\"Airspace\",C8)),\"\")","v":""},{"$f":"IF(D9=TRUE,ISNUMBER(SEARCH(\"Airspace\",D8)),\"\")","v":""},{"$f":"IF(E9=TRUE,ISNUMBER(SEARCH(\"Airspace\",E8)),\"\")","v":""},"","",""]
["Air space resistance",{"$f":"IF(B10=TRUE,INDEX(User_Library!$G$10:$G$64,MATCH(B8,User_Library!$E$10:$E$64,0)),\"\")","v":""},{"$f":"IF(C10=TRUE,INDEX(User_Library!$G$10:$G$64,MATCH(C8,User_Library!$E$10:$E$64,0)),\"\")","v":""},{"$f":"IF(D10=TRUE,INDEX(User_Library!$G$10:$G$64,MATCH(D8,User_Library!$E$10:$E$64,0)),\"\")","v":""},{"$f":"IF(E10=TRUE,INDEX(User_Library!$G$10:$G$64,MATCH(E8,User_Library!$E$10:$E$64,0)),\"\")","v":""},{"$f":"IF(F10=TRUE,INDEX(User_Library!$G$10:$G$64,MATCH(F8,User_Library!$E$10:$E$64,0)),\"\")","v":""},{"$f":"IF(G10=TRUE,INDEX(User_Library!$G$10:$G$64,MATCH(G8,User_Library!$E$10:$E$64,0)),\"\")","v":""},{"$f":"IF(H10=TRUE,INDEX(User_Library!$G$10:$G$64,MATCH(H8,User_Library!$E$10:$E$64,0)),\"\")","v":""}]
["Veniltation Strategy",null,{"$f":"IF(C10=TRUE,Wall_Systems!D49,\"\")","v":""},{"$f":"IF(D10=TRUE,Wall_Systems!D49,\"\")","v":""},{"$f":"IF(E10=TRUE,Wall_Systems!F49,\"\")","v":""},{"$f":"IF(F10=TRUE,Wall_Systems!G49,\"\")","v":""},{"$f":"IF(G10=TRUE,Wall_Systems!H49,\"\")","v":""},{"$f":"IF(H10=TRUE,Wall_Systems!I49,\"\")","v":""}]
["Derating Factor",{"$f":"C13","v":1},{"$f":"IF(C12=\"Unventilated\",\"1\",IF(C12=\"Slightly Ventilated\",\"0.45\",IF(C12=\"Well Ventilated\",\"0\",1)))","v":1},{"$f":"IF(D12=\"Unventilated\",\"1\",IF(D12=\"Slightly Ventilated\",\"0.45\",IF(D12=\"Well Ventilated\",\"0\",1)))","v":1},1,1,1,1]
["Derating Bridged Layer",{"$f":"IF(B12=\"No Ventilation\",B11*1,IF(B12=\"Slightly Ventilated\",B11*0.55,IF(B12=\"Well Ventilated\",B11*0)))","v":false},{"$f":"IF(C12=\"Unventilated\",C11*1,IF(C12=\"Slightly Ventilated\",C11*0.55,IF(C12=\"Well Ventilated\",C11*0)))","v":false},{"$f":"IF(D12=\"Unventilated\",D11*1,IF(D12=\"Slightly Ventilated\",D11*0.55,IF(D12=\"Well Ventilated\",D11*0)))","v":false},false,false,false,false]
["Thickness (mm)",{"$f":"IF(B9=TRUE,Wall_Systems!C54,\"\")","v":""},{"$f":"IF(C9=TRUE,Wall_Systems!D54,\"\")","v":""},{"$f":"IF(D9=TRUE,Wall_Systems!E54,\"\")","v":""},{"$f":"IF(E9=TRUE,Wall_Systems!F54,\"\")","v":""},{"$f":"IF(F9=TRUE,Wall_Systems!G54,\"\")","v":""},{"$f":"IF(G9=TRUE,Wall_Systems!H54,\"\")","v":""},{"$f":"IF(H9=TRUE,Wall_Systems!I54,\"\")","v":""}]
{"$rows_left_out":84}
{"sheet":"NCC_Support_Text","index":11,"n_rows":179,"n_cols":23,"rows_kept":179,"cut":false,"hidden":true,"merged":[[30,1,30,8],[30,9,30,16],[60,11,60,21],[69,11,69,21],[0,0,2,16383]]}
["All information held within this worksheet directly references Part J1 Walls and Glazing (a-g), J15a and J1.5b."]
[]
[]
[]
[]
[]
["Building Classes",null,null,null,null,null,null,null,null,"Australian Capital Territory",null,"New South Wales",null,"South Australia",null,"Victoria"]
["Class 2 - apartment building (Common Area)",2,null,null,"Column1",null,"Select",null,null,"Climate Zone 7 - Cool temperate",null,"Climate Zone 2 - Warm humid summer, mild winter",null,"Climate Zone 4 - Hot dry summer, cool winter",null,"Climate Zone 4 - Hot dry summer, cool winter"]
["Class 3 - student accommodation",3,null,null,"ACT",null,"Yes",null,null,null,null,"Climate Zone 4 - Hot dry summer, cool winter",null,"Climate Zone 5 - Warm temperate",null,"Climate Zone 6 - Mild temperate"]
["Class 3 - hotel",3,null,null,"NSW",null,null,null,null,null,null,"Climate Zone 5 - Warm temperate",null,"Climate Zone 6 - Mild temperate",null,"Climate Zone 7 - Cool temperate"]
["Class 3 - other",3,null,null,"NT",null,"No",null,null,null,null,"Climate Zone 6 - Mild temperate",null,null,null,"Climate Zone 8 - Alpine"]
["Class 5 - office building",5,null,null,"QLD",null,null,null,null,null,null,"Climate Zone 7 - Cool temperate"]
["Class 6 - department stores, shopping centres",6,null,null,"SA",null,null,null,null,null,null,"Climate Zone 8 - Alpine"]
["Class 6 - restaurants, cafes, bars",6,null,null,"TAS"]
["Class 8 - factory",8,null,null,"VIC",null,null,null,null,"Northern Territory",null,"Queensland",null,"Tasmania",null,"Western Australia"]
{"$rows_left_out":164}